cordova run android exited with exit code 1












0















FAILURE: Build failed with an exception.





  • What went wrong:
    Execution failed for task ':app:processDebugGoogleServices'.




    Please fix the version conflict either by updating the version of the google-services plugin (information about the latest version is available at https://bintray.com/android/android-tools/com.google.gms.google-services/) or updating the version of com.google.android.gms to 11.6.2.




  • Try:
    Run with --stacktrace option to get the stack trace. Run with --info or --debug option to get more log output.


  • Get more help at https://help.gradle.org



BUILD FAILED in 3s
21 actionable tasks: 1 executed, 20 up-to-date
cmd: Command failed with exit code 1 Error output:
FAILURE: Build failed with an exception.





  • What went wrong:
    Execution failed for task ':app:processDebugGoogleServices'.




    Please fix the version conflict either by updating the version of the google-services plugin (information about the latest version is available at https://bintray.com/android/android-tools/com.google.gms.google-services/) or updating the version of com.google.android.gms to 11.6.2.




  • Try:
    Run with --stacktrace option to get the stack trace. Run with --info or --debug option to get more log output.


  • Get more help at https://help.gradle.org



BUILD FAILED in 3s
[ERROR] An error occurred while running subprocess cordova.



    cordova run android exited with exit code 1.

Re-running this command with the --verbose flag may provide more information.









share|improve this question



























    0















    FAILURE: Build failed with an exception.





    • What went wrong:
      Execution failed for task ':app:processDebugGoogleServices'.




      Please fix the version conflict either by updating the version of the google-services plugin (information about the latest version is available at https://bintray.com/android/android-tools/com.google.gms.google-services/) or updating the version of com.google.android.gms to 11.6.2.




    • Try:
      Run with --stacktrace option to get the stack trace. Run with --info or --debug option to get more log output.


    • Get more help at https://help.gradle.org



    BUILD FAILED in 3s
    21 actionable tasks: 1 executed, 20 up-to-date
    cmd: Command failed with exit code 1 Error output:
    FAILURE: Build failed with an exception.





    • What went wrong:
      Execution failed for task ':app:processDebugGoogleServices'.




      Please fix the version conflict either by updating the version of the google-services plugin (information about the latest version is available at https://bintray.com/android/android-tools/com.google.gms.google-services/) or updating the version of com.google.android.gms to 11.6.2.




    • Try:
      Run with --stacktrace option to get the stack trace. Run with --info or --debug option to get more log output.


    • Get more help at https://help.gradle.org



    BUILD FAILED in 3s
    [ERROR] An error occurred while running subprocess cordova.



        cordova run android exited with exit code 1.

    Re-running this command with the --verbose flag may provide more information.









    share|improve this question

























      0












      0








      0








      FAILURE: Build failed with an exception.





      • What went wrong:
        Execution failed for task ':app:processDebugGoogleServices'.




        Please fix the version conflict either by updating the version of the google-services plugin (information about the latest version is available at https://bintray.com/android/android-tools/com.google.gms.google-services/) or updating the version of com.google.android.gms to 11.6.2.




      • Try:
        Run with --stacktrace option to get the stack trace. Run with --info or --debug option to get more log output.


      • Get more help at https://help.gradle.org



      BUILD FAILED in 3s
      21 actionable tasks: 1 executed, 20 up-to-date
      cmd: Command failed with exit code 1 Error output:
      FAILURE: Build failed with an exception.





      • What went wrong:
        Execution failed for task ':app:processDebugGoogleServices'.




        Please fix the version conflict either by updating the version of the google-services plugin (information about the latest version is available at https://bintray.com/android/android-tools/com.google.gms.google-services/) or updating the version of com.google.android.gms to 11.6.2.




      • Try:
        Run with --stacktrace option to get the stack trace. Run with --info or --debug option to get more log output.


      • Get more help at https://help.gradle.org



      BUILD FAILED in 3s
      [ERROR] An error occurred while running subprocess cordova.



          cordova run android exited with exit code 1.

      Re-running this command with the --verbose flag may provide more information.









      share|improve this question














      FAILURE: Build failed with an exception.





      • What went wrong:
        Execution failed for task ':app:processDebugGoogleServices'.




        Please fix the version conflict either by updating the version of the google-services plugin (information about the latest version is available at https://bintray.com/android/android-tools/com.google.gms.google-services/) or updating the version of com.google.android.gms to 11.6.2.




      • Try:
        Run with --stacktrace option to get the stack trace. Run with --info or --debug option to get more log output.


      • Get more help at https://help.gradle.org



      BUILD FAILED in 3s
      21 actionable tasks: 1 executed, 20 up-to-date
      cmd: Command failed with exit code 1 Error output:
      FAILURE: Build failed with an exception.





      • What went wrong:
        Execution failed for task ':app:processDebugGoogleServices'.




        Please fix the version conflict either by updating the version of the google-services plugin (information about the latest version is available at https://bintray.com/android/android-tools/com.google.gms.google-services/) or updating the version of com.google.android.gms to 11.6.2.




      • Try:
        Run with --stacktrace option to get the stack trace. Run with --info or --debug option to get more log output.


      • Get more help at https://help.gradle.org



      BUILD FAILED in 3s
      [ERROR] An error occurred while running subprocess cordova.



          cordova run android exited with exit code 1.

      Re-running this command with the --verbose flag may provide more information.






      ionic-framework






      share|improve this question













      share|improve this question











      share|improve this question




      share|improve this question










      asked Nov 20 '18 at 8:22









      Chandan SenChandan Sen

      11




      11
























          0






          active

          oldest

          votes











          Your Answer






          StackExchange.ifUsing("editor", function () {
          StackExchange.using("externalEditor", function () {
          StackExchange.using("snippets", function () {
          StackExchange.snippets.init();
          });
          });
          }, "code-snippets");

          StackExchange.ready(function() {
          var channelOptions = {
          tags: "".split(" "),
          id: "1"
          };
          initTagRenderer("".split(" "), "".split(" "), channelOptions);

          StackExchange.using("externalEditor", function() {
          // Have to fire editor after snippets, if snippets enabled
          if (StackExchange.settings.snippets.snippetsEnabled) {
          StackExchange.using("snippets", function() {
          createEditor();
          });
          }
          else {
          createEditor();
          }
          });

          function createEditor() {
          StackExchange.prepareEditor({
          heartbeatType: 'answer',
          autoActivateHeartbeat: false,
          convertImagesToLinks: true,
          noModals: true,
          showLowRepImageUploadWarning: true,
          reputationToPostImages: 10,
          bindNavPrevention: true,
          postfix: "",
          imageUploader: {
          brandingHtml: "Powered by u003ca class="icon-imgur-white" href="https://imgur.com/"u003eu003c/au003e",
          contentPolicyHtml: "User contributions licensed under u003ca href="https://creativecommons.org/licenses/by-sa/3.0/"u003ecc by-sa 3.0 with attribution requiredu003c/au003e u003ca href="https://stackoverflow.com/legal/content-policy"u003e(content policy)u003c/au003e",
          allowUrls: true
          },
          onDemand: true,
          discardSelector: ".discard-answer"
          ,immediatelyShowMarkdownHelp:true
          });


          }
          });














          draft saved

          draft discarded


















          StackExchange.ready(
          function () {
          StackExchange.openid.initPostLogin('.new-post-login', 'https%3a%2f%2fstackoverflow.com%2fquestions%2f53388838%2fcordova-run-android-exited-with-exit-code-1%23new-answer', 'question_page');
          }
          );

          Post as a guest















          Required, but never shown

























          0






          active

          oldest

          votes








          0






          active

          oldest

          votes









          active

          oldest

          votes






          active

          oldest

          votes
















          draft saved

          draft discarded




















































          Thanks for contributing an answer to Stack Overflow!


          • Please be sure to answer the question. Provide details and share your research!

          But avoid



          • Asking for help, clarification, or responding to other answers.

          • Making statements based on opinion; back them up with references or personal experience.


          To learn more, see our tips on writing great answers.




          draft saved


          draft discarded














          StackExchange.ready(
          function () {
          StackExchange.openid.initPostLogin('.new-post-login', 'https%3a%2f%2fstackoverflow.com%2fquestions%2f53388838%2fcordova-run-android-exited-with-exit-code-1%23new-answer', 'question_page');
          }
          );

          Post as a guest















          Required, but never shown





















































          Required, but never shown














          Required, but never shown












          Required, but never shown







          Required, but never shown

































          Required, but never shown














          Required, but never shown












          Required, but never shown







          Required, but never shown







          Popular posts from this blog

          MongoDB - Not Authorized To Execute Command

          in spring boot 2.1 many test slices are not allowed anymore due to multiple @BootstrapWith

          How to fix TextFormField cause rebuild widget in Flutter