Failed to execute goal org.apache.maven.plugins:maven-surefire-plugin:2.19.1:test (default-test) on project
I am facing below error when i try to run the maven project using command 'mvn install'.. seems to be forked process error.. Can someone please help me on this..
[ERROR] Failed to execute goal org.apache.maven.plugins:maven-surefire-plugin:2.19.1:test (default-test) on project ConnectAutomationFramework: Execution default-test of goal org.apache.maven.plugins:maven-surefire-plugin:2.19.1:test failed: There was an error in the forked process [ERROR] java.lang.NoClassDefFoundError: [ERROR] at java.lang.Class.getDeclaredMethods0(Native Method) [ERROR] at java.lang.Class.privateGetDeclaredMethods(Class.java:2442) [ERROR] at java.lang.Class.privateGetPublicMethods(Class.java:2562) [ERROR] at java.lang.Class.getMethods(Class.java:1427) [ERROR] at org.testng.internal.TestNGClassFinder.(TestNGClassFinder.java:59) [ERROR] at org.testng.TestRunner.initMethods(TestRunner.java:409) [ERROR] at org.testng.TestRunner.init(TestRunner.java:235) [ERROR] at org.testng.TestRunner.init(TestRunner.java:205) [ERROR] at org.testng.TestRunner.(TestRunner.java:153) [ERROR] at org.testng.SuiteRunner$DefaultTestRunnerFactory.newTestRunner(SuiteRunner.java:522) [ERROR] at org.testng.SuiteRunner.init(SuiteRunner.java:157) [ERROR] at org.testng.SuiteRunner.(SuiteRunner.java:111) [ERROR] at org.testng.TestNG.createSuiteRunner(TestNG.java:1299) [ERROR] at org.testng.TestNG.createSuiteRunners(TestNG.java:1286) [ERROR] at org.testng.TestNG.runSuitesLocally(TestNG.java:1140) [ERROR] at org.testng.TestNG.run(TestNG.java:1057) [ERROR] at org.apache.maven.surefire.testng.TestNGExecutor.run(TestNGExecutor.java:281) [ERROR] at org.apache.maven.surefire.testng.TestNGXmlTestSuite.execute(TestNGXmlTestSuite.java:75) [ERROR] at org.apache.maven.surefire.testng.TestNGProvider.invoke(TestNGProvider.java:121) [ERROR] at org.apache.maven.surefire.booter.ForkedBooter.invokeProviderInSameClassLoader(ForkedBooter.java:290) [ERROR] at org.apache.maven.surefire.booter.ForkedBooter.runSuitesInProcess (ForkedBooter.java:242) [ERROR] at org.apache.maven.surefire.booter.ForkedBooter.main(ForkedBooter.java:121)
java maven
add a comment |
I am facing below error when i try to run the maven project using command 'mvn install'.. seems to be forked process error.. Can someone please help me on this..
[ERROR] Failed to execute goal org.apache.maven.plugins:maven-surefire-plugin:2.19.1:test (default-test) on project ConnectAutomationFramework: Execution default-test of goal org.apache.maven.plugins:maven-surefire-plugin:2.19.1:test failed: There was an error in the forked process [ERROR] java.lang.NoClassDefFoundError: [ERROR] at java.lang.Class.getDeclaredMethods0(Native Method) [ERROR] at java.lang.Class.privateGetDeclaredMethods(Class.java:2442) [ERROR] at java.lang.Class.privateGetPublicMethods(Class.java:2562) [ERROR] at java.lang.Class.getMethods(Class.java:1427) [ERROR] at org.testng.internal.TestNGClassFinder.(TestNGClassFinder.java:59) [ERROR] at org.testng.TestRunner.initMethods(TestRunner.java:409) [ERROR] at org.testng.TestRunner.init(TestRunner.java:235) [ERROR] at org.testng.TestRunner.init(TestRunner.java:205) [ERROR] at org.testng.TestRunner.(TestRunner.java:153) [ERROR] at org.testng.SuiteRunner$DefaultTestRunnerFactory.newTestRunner(SuiteRunner.java:522) [ERROR] at org.testng.SuiteRunner.init(SuiteRunner.java:157) [ERROR] at org.testng.SuiteRunner.(SuiteRunner.java:111) [ERROR] at org.testng.TestNG.createSuiteRunner(TestNG.java:1299) [ERROR] at org.testng.TestNG.createSuiteRunners(TestNG.java:1286) [ERROR] at org.testng.TestNG.runSuitesLocally(TestNG.java:1140) [ERROR] at org.testng.TestNG.run(TestNG.java:1057) [ERROR] at org.apache.maven.surefire.testng.TestNGExecutor.run(TestNGExecutor.java:281) [ERROR] at org.apache.maven.surefire.testng.TestNGXmlTestSuite.execute(TestNGXmlTestSuite.java:75) [ERROR] at org.apache.maven.surefire.testng.TestNGProvider.invoke(TestNGProvider.java:121) [ERROR] at org.apache.maven.surefire.booter.ForkedBooter.invokeProviderInSameClassLoader(ForkedBooter.java:290) [ERROR] at org.apache.maven.surefire.booter.ForkedBooter.runSuitesInProcess (ForkedBooter.java:242) [ERROR] at org.apache.maven.surefire.booter.ForkedBooter.main(ForkedBooter.java:121)
java maven
add a comment |
I am facing below error when i try to run the maven project using command 'mvn install'.. seems to be forked process error.. Can someone please help me on this..
[ERROR] Failed to execute goal org.apache.maven.plugins:maven-surefire-plugin:2.19.1:test (default-test) on project ConnectAutomationFramework: Execution default-test of goal org.apache.maven.plugins:maven-surefire-plugin:2.19.1:test failed: There was an error in the forked process [ERROR] java.lang.NoClassDefFoundError: [ERROR] at java.lang.Class.getDeclaredMethods0(Native Method) [ERROR] at java.lang.Class.privateGetDeclaredMethods(Class.java:2442) [ERROR] at java.lang.Class.privateGetPublicMethods(Class.java:2562) [ERROR] at java.lang.Class.getMethods(Class.java:1427) [ERROR] at org.testng.internal.TestNGClassFinder.(TestNGClassFinder.java:59) [ERROR] at org.testng.TestRunner.initMethods(TestRunner.java:409) [ERROR] at org.testng.TestRunner.init(TestRunner.java:235) [ERROR] at org.testng.TestRunner.init(TestRunner.java:205) [ERROR] at org.testng.TestRunner.(TestRunner.java:153) [ERROR] at org.testng.SuiteRunner$DefaultTestRunnerFactory.newTestRunner(SuiteRunner.java:522) [ERROR] at org.testng.SuiteRunner.init(SuiteRunner.java:157) [ERROR] at org.testng.SuiteRunner.(SuiteRunner.java:111) [ERROR] at org.testng.TestNG.createSuiteRunner(TestNG.java:1299) [ERROR] at org.testng.TestNG.createSuiteRunners(TestNG.java:1286) [ERROR] at org.testng.TestNG.runSuitesLocally(TestNG.java:1140) [ERROR] at org.testng.TestNG.run(TestNG.java:1057) [ERROR] at org.apache.maven.surefire.testng.TestNGExecutor.run(TestNGExecutor.java:281) [ERROR] at org.apache.maven.surefire.testng.TestNGXmlTestSuite.execute(TestNGXmlTestSuite.java:75) [ERROR] at org.apache.maven.surefire.testng.TestNGProvider.invoke(TestNGProvider.java:121) [ERROR] at org.apache.maven.surefire.booter.ForkedBooter.invokeProviderInSameClassLoader(ForkedBooter.java:290) [ERROR] at org.apache.maven.surefire.booter.ForkedBooter.runSuitesInProcess (ForkedBooter.java:242) [ERROR] at org.apache.maven.surefire.booter.ForkedBooter.main(ForkedBooter.java:121)
java maven
I am facing below error when i try to run the maven project using command 'mvn install'.. seems to be forked process error.. Can someone please help me on this..
[ERROR] Failed to execute goal org.apache.maven.plugins:maven-surefire-plugin:2.19.1:test (default-test) on project ConnectAutomationFramework: Execution default-test of goal org.apache.maven.plugins:maven-surefire-plugin:2.19.1:test failed: There was an error in the forked process [ERROR] java.lang.NoClassDefFoundError: [ERROR] at java.lang.Class.getDeclaredMethods0(Native Method) [ERROR] at java.lang.Class.privateGetDeclaredMethods(Class.java:2442) [ERROR] at java.lang.Class.privateGetPublicMethods(Class.java:2562) [ERROR] at java.lang.Class.getMethods(Class.java:1427) [ERROR] at org.testng.internal.TestNGClassFinder.(TestNGClassFinder.java:59) [ERROR] at org.testng.TestRunner.initMethods(TestRunner.java:409) [ERROR] at org.testng.TestRunner.init(TestRunner.java:235) [ERROR] at org.testng.TestRunner.init(TestRunner.java:205) [ERROR] at org.testng.TestRunner.(TestRunner.java:153) [ERROR] at org.testng.SuiteRunner$DefaultTestRunnerFactory.newTestRunner(SuiteRunner.java:522) [ERROR] at org.testng.SuiteRunner.init(SuiteRunner.java:157) [ERROR] at org.testng.SuiteRunner.(SuiteRunner.java:111) [ERROR] at org.testng.TestNG.createSuiteRunner(TestNG.java:1299) [ERROR] at org.testng.TestNG.createSuiteRunners(TestNG.java:1286) [ERROR] at org.testng.TestNG.runSuitesLocally(TestNG.java:1140) [ERROR] at org.testng.TestNG.run(TestNG.java:1057) [ERROR] at org.apache.maven.surefire.testng.TestNGExecutor.run(TestNGExecutor.java:281) [ERROR] at org.apache.maven.surefire.testng.TestNGXmlTestSuite.execute(TestNGXmlTestSuite.java:75) [ERROR] at org.apache.maven.surefire.testng.TestNGProvider.invoke(TestNGProvider.java:121) [ERROR] at org.apache.maven.surefire.booter.ForkedBooter.invokeProviderInSameClassLoader(ForkedBooter.java:290) [ERROR] at org.apache.maven.surefire.booter.ForkedBooter.runSuitesInProcess (ForkedBooter.java:242) [ERROR] at org.apache.maven.surefire.booter.ForkedBooter.main(ForkedBooter.java:121)
java maven
java maven
edited Nov 20 '18 at 16:15
asked Nov 19 '18 at 17:22
saravana kumar
115
115
add a comment |
add a comment |
0
active
oldest
votes
Your Answer
StackExchange.ifUsing("editor", function () {
StackExchange.using("externalEditor", function () {
StackExchange.using("snippets", function () {
StackExchange.snippets.init();
});
});
}, "code-snippets");
StackExchange.ready(function() {
var channelOptions = {
tags: "".split(" "),
id: "1"
};
initTagRenderer("".split(" "), "".split(" "), channelOptions);
StackExchange.using("externalEditor", function() {
// Have to fire editor after snippets, if snippets enabled
if (StackExchange.settings.snippets.snippetsEnabled) {
StackExchange.using("snippets", function() {
createEditor();
});
}
else {
createEditor();
}
});
function createEditor() {
StackExchange.prepareEditor({
heartbeatType: 'answer',
autoActivateHeartbeat: false,
convertImagesToLinks: true,
noModals: true,
showLowRepImageUploadWarning: true,
reputationToPostImages: 10,
bindNavPrevention: true,
postfix: "",
imageUploader: {
brandingHtml: "Powered by u003ca class="icon-imgur-white" href="https://imgur.com/"u003eu003c/au003e",
contentPolicyHtml: "User contributions licensed under u003ca href="https://creativecommons.org/licenses/by-sa/3.0/"u003ecc by-sa 3.0 with attribution requiredu003c/au003e u003ca href="https://stackoverflow.com/legal/content-policy"u003e(content policy)u003c/au003e",
allowUrls: true
},
onDemand: true,
discardSelector: ".discard-answer"
,immediatelyShowMarkdownHelp:true
});
}
});
Sign up or log in
StackExchange.ready(function () {
StackExchange.helpers.onClickDraftSave('#login-link');
});
Sign up using Google
Sign up using Facebook
Sign up using Email and Password
Post as a guest
Required, but never shown
StackExchange.ready(
function () {
StackExchange.openid.initPostLogin('.new-post-login', 'https%3a%2f%2fstackoverflow.com%2fquestions%2f53379745%2ffailed-to-execute-goal-org-apache-maven-pluginsmaven-surefire-plugin2-19-1tes%23new-answer', 'question_page');
}
);
Post as a guest
Required, but never shown
0
active
oldest
votes
0
active
oldest
votes
active
oldest
votes
active
oldest
votes
Thanks for contributing an answer to Stack Overflow!
- Please be sure to answer the question. Provide details and share your research!
But avoid …
- Asking for help, clarification, or responding to other answers.
- Making statements based on opinion; back them up with references or personal experience.
To learn more, see our tips on writing great answers.
Some of your past answers have not been well-received, and you're in danger of being blocked from answering.
Please pay close attention to the following guidance:
- Please be sure to answer the question. Provide details and share your research!
But avoid …
- Asking for help, clarification, or responding to other answers.
- Making statements based on opinion; back them up with references or personal experience.
To learn more, see our tips on writing great answers.
Sign up or log in
StackExchange.ready(function () {
StackExchange.helpers.onClickDraftSave('#login-link');
});
Sign up using Google
Sign up using Facebook
Sign up using Email and Password
Post as a guest
Required, but never shown
StackExchange.ready(
function () {
StackExchange.openid.initPostLogin('.new-post-login', 'https%3a%2f%2fstackoverflow.com%2fquestions%2f53379745%2ffailed-to-execute-goal-org-apache-maven-pluginsmaven-surefire-plugin2-19-1tes%23new-answer', 'question_page');
}
);
Post as a guest
Required, but never shown
Sign up or log in
StackExchange.ready(function () {
StackExchange.helpers.onClickDraftSave('#login-link');
});
Sign up using Google
Sign up using Facebook
Sign up using Email and Password
Post as a guest
Required, but never shown
Sign up or log in
StackExchange.ready(function () {
StackExchange.helpers.onClickDraftSave('#login-link');
});
Sign up using Google
Sign up using Facebook
Sign up using Email and Password
Post as a guest
Required, but never shown
Sign up or log in
StackExchange.ready(function () {
StackExchange.helpers.onClickDraftSave('#login-link');
});
Sign up using Google
Sign up using Facebook
Sign up using Email and Password
Sign up using Google
Sign up using Facebook
Sign up using Email and Password
Post as a guest
Required, but never shown
Required, but never shown
Required, but never shown
Required, but never shown
Required, but never shown
Required, but never shown
Required, but never shown
Required, but never shown
Required, but never shown